Main Menu

build error bitshares 2

Started by bitcoinerS, November 12, 2015, 10:45:51 PM

Previous topic - Next topic

0 Members and 1 Guest are viewing this topic.

clayop

Quote from: bitcoinerS on November 12, 2015, 10:45:51 PM
New Ubuntu install. Failing to build latest bitshares.


...
[ 48%] Building CXX object libraries/fc/CMakeFiles/all_tests.dir/tests/utf8_test.cpp.o
make[2]: *** No rule to make target '/usr/lib/x86_64-linux-gnu/libcurses.so', needed by 'libraries/fc/all_tests'.  Stop.
CMakeFiles/Makefile2:153: recipe for target 'libraries/fc/CMakeFiles/all_tests.dir/all' failed
make[1]: *** [libraries/fc/CMakeFiles/all_tests.dir/all] Error 2
Makefile:116: recipe for target 'all' failed
make: *** [all] Error 2
~/local/bitshares-2((HEAD detached at v2.15.306)) $

You may use "make cli_wallet witness_node"
Bitshares Korea - [url="http://www.bitshares.kr"]http://www.bitshares.kr[/url]
Vote for me and see Korean Bitshares community grows
delegate-clayop

bitcoinerS

New Ubuntu install. Failing to build latest bitshares.


...
[ 48%] Building CXX object libraries/fc/CMakeFiles/all_tests.dir/tests/utf8_test.cpp.o
make[2]: *** No rule to make target '/usr/lib/x86_64-linux-gnu/libcurses.so', needed by 'libraries/fc/all_tests'.  Stop.
CMakeFiles/Makefile2:153: recipe for target 'libraries/fc/CMakeFiles/all_tests.dir/all' failed
make[1]: *** [libraries/fc/CMakeFiles/all_tests.dir/all] Error 2
Makefile:116: recipe for target 'all' failed
make: *** [all] Error 2
~/local/bitshares-2((HEAD detached at v2.15.306)) $
>>> approve bitcoiners