Main Menu

ubuntu 14.02 cmake . make错误

Started by zhao150, July 15, 2014, 05:32:15 AM

Previous topic - Next topic

0 Members and 1 Guest are viewing this topic.

alt

linux下编译bug,你可以去报告一下  :)

zhao150

sudo apt-get update
sudo apt-get install cmake git libreadline-dev uuid-dev g++ libdb++-dev libdb-dev zip libssl-dev openssl build-essential python-dev autotools-dev libicu-dev build-essential libbz2-dev libboost-dev libboost-all-dev
git clone https://github.com/BitShares/bitshares_toolkit.git
cd bitshares_toolkit
git submodule init
git submodule update
cmake .
make
最后一步make有时对有时错,我不知道什么意思,是否是bm在更新代码。下面我提供错误信息:
[ 16%] Building C object libraries/fc/vendor/scrypt-jane/CMakeFiles/scrypt.dir/scrypt-jane.c.o
cc: error: unrecognized command line option '-no-integrated-as'
make[2]: *** [libraries/fc/vendor/scrypt-jane/CMakeFiles/scrypt.dir/scrypt-jane.c.o] Error 1
make[1]: *** [libraries/fc/vendor/scrypt-jane/CMakeFiles/scrypt.dir/all] Error 2
make: *** [all] Error 2
ubuntu@vm10-128-1-183:~/bitshares_toolkit$
老子早就不想当代表了