Quote from: abit on March 24, 2016, 05:00:44 PM
https://github.com/cryptonomex/graphene/wiki/build-ubuntu
compiles well, now going to test :)
Next step — to compile Qt for desktop!
This section allows you to view all posts made by this member. Note that you can only see posts made in areas you currently have access to.
Show posts MenuQuote from: abit on March 24, 2016, 05:00:44 PM
https://github.com/cryptonomex/graphene/wiki/build-ubuntu
QuoteWhich repo and version did you build from? The above error occurs when building with an old version of the libraries/fc submodule.
Quote from: abit on March 24, 2016, 05:00:44 PM
Detailed steps please? lib versions?QuoteNo need to hack.. try libs/dependencies with recommended versions.
1. I had troubles with boost (with SSL3), but I have fixed boost sources with hack.
Linking CXX executable embed_genesis
../chain/libgraphene_chain.a(types.cpp.o): In function `graphene::chain::extended_public_key_type::operator fc::ecc::extended_public_key() const':
types.cpp:(.text+0x595): undefined reference to `fc::ecc::extended_public_key::deserialize(fc::array<char, 78ul> const&)'
../chain/libgraphene_chain.a(types.cpp.o): In function `graphene::chain::extended_private_key_type::operator fc::ecc::extended_private_key() const':
types.cpp:(.text+0x9f5): undefined reference to `fc::ecc::extended_private_key::deserialize(fc::array<char, 78ul> const&)'
collect2: error: ld returned 1 exit status
make[2]: *** [libraries/egenesis/embed_genesis] Error 1
make[1]: *** [libraries/egenesis/CMakeFiles/embed_genesis.dir/all] Error 2
make: *** [all] Error 2
Page created in 0.008 seconds with 12 queries.