Show Posts

This section allows you to view all posts made by this member. Note that you can only see posts made in areas you currently have access to.


Messages - Saleh

Pages: [1] 2 3
1
Stakeholder Proposals / Re: Lets vote for lower fees!
« on: October 18, 2015, 10:06:42 am »
 +5%
guys, you are OK with the current fee.
but in fact, Chinese and other developing country will never accept the high transfer fee.
In China we spent no fee with alipay and most  bank card.
BTS will lose these market if the fee still keep about 0.6CNY
If you don't care about these market, OK, just keep higer fees. wish enough American like BTS and can be a real user.

2
中文(Chinese) / Re: 咨询DNS获取BTS
« on: January 21, 2015, 01:56:09 pm »
一直都没下载使用过DNS钱包,是不是意味着没有办法拿到分到的BTS了?
wallet_check_sharedrop 用这个命令看,没有看到DNS导入的BTS,

wallet_import_keys_from_json F:\dns5051\dns5051.json 密码 账户名

请问下这个格式正确吗?账户名是填DNS钱包账户名,还是当前BTS钱包的账户名,填DNS钱包账户名执行会报错。

格式是对的,密码是DNS的密码,账户是BTS账户,就是要把这些密钥导入到哪个账户名,建议新建个BTS钱包和账户用来导入,或者先备份之前的BTS钱包。
密码最好用双引号引起来。
wallet_import_keys_from_json F:\dns5051\dns5051.json "密码" 账户名

报的错误是什么

3
中文(Chinese) / Re: 比特股投资白皮书(中文版)V1.0正式发布
« on: September 16, 2014, 04:17:47 am »
2. page 13 : “截止到2014年10月,”,这个时间给读者的感觉是超前了,我认为应该是9月吧

4
中文(Chinese) / Re: 比特股投资白皮书(中文版)V1.0正式发布
« on: September 16, 2014, 03:56:38 am »
多余字:
1. page 2 : 更多人的认为比特币主要是一种去中心化的支付系统,应该是 更多人认为...

5
中文(Chinese) / Re: 华语地区Meetup推广计划
« on: September 04, 2014, 02:51:32 am »
我申请上海的Meetup,有没有愿意一起出力的社区同学
I am in

6
中文(Chinese) / Re: 客户端0.4.8-b问题收集帖
« on: August 27, 2014, 02:44:32 am »
Mac GUI客户端一打开就Crash(界面显示Connext to BitShares X network),然后卸载,删除~/Library/Application Support/BitShares X目录后,重新安装依然Crash
Process:         BitSharesX [328]
Path:            /Applications/BitSharesX.app/Contents/MacOS/BitSharesX
Identifier:      org.bitshares.btsx
Version:         .. (..)
Code Type:       X86-64 (Native)
Parent Process:  launchd [171]
Responsible:     BitSharesX [328]
User ID:         503

Date/Time:       2014-08-27 10:21:45.314 +0800
OS Version:      Mac OS X 10.9.4 (13E28)
Report Version:  11
Anonymous UUID:  9B831044-4C71-E9CB-03BC-15C8DB560028


Crashed Thread:  0  Dispatch queue: com.apple.main-thread

Exception Type:  EXC_CRASH (SIGABRT)
Exception Codes: 0x0000000000000000, 0x0000000000000000

Application Specific Information:
abort() called
*** error for object 0x7fff77dd6330: pointer being freed was not allocated
 

Thread 0 Crashed:: Dispatch queue: com.apple.main-thread
0   libsystem_kernel.dylib           0x00007fff8a427866 __pthread_kill + 10
1   libsystem_pthread.dylib          0x00007fff8e21635c pthread_kill + 92
2   libsystem_c.dylib                0x00007fff92bf1b1a abort + 125
3   libsystem_malloc.dylib           0x00007fff8e49e07f free + 411
4   libstdc++.6.dylib                0x0000000107995bce std::basic_stringbuf<char, std::char_traits<char>, std::allocator<char> >::overflow(int) + 302
5   libstdc++.6.dylib                0x00000001079998ce std::basic_streambuf<char, std::char_traits<char> >::xsputn(char const*, long) + 62
6   libstdc++.6.dylib                0x00007fff91930b44 std::basic_ostream<char, std::char_traits<char> >& std::__ostream_insert<char, std::char_traits<char> >(std::basic_ostream<char, std::char_traits<char> >&, char const*, long) + 430
7   com.AdobeAAMDetectLib.AdobeAAMDetect   0x000000012216a239 NP_Initialize + 409
8   QtWebKit                         0x0000000103eac6b5 WebCore::PluginPackage::load() + 245
9   QtWebKit                         0x0000000103eab71a WebCore::PluginPackage::fetchInfo() + 42
10  QtWebKit                         0x0000000103dfc157 WebCore::PluginPackage::createPackage(WTF::String const&, long const&) + 55
11  QtWebKit                         0x0000000103df8915 WebCore::PluginDatabase::refresh() + 677
12  QtWebKit                         0x0000000103df840c WebCore::PluginDatabase::installedPlugins(bool) + 236
13  QtWebKit                         0x0000000103a3de04 PlatformStrategiesQt::getPluginInfo(WebCore::Page const*, WTF::Vector<WebCore::PluginInfo, 0ul, WTF::CrashOnOverflow>&) + 1348
14  QtWebKit                         0x0000000103d5f976 WebCore::PluginData::PluginData(WebCore::Page const*) + 134
15  QtWebKit                         0x0000000103d45c4e WebCore::Page::pluginData() const + 46
16  QtWebKit                         0x00000001048464a1 WebCore::DOMImplementation::createDocument(WTF::String const&, WebCore::Frame*, WebCore::KURL const&, bool) + 305
17  QtWebKit                         0x0000000103caa503 WebCore::DocumentWriter::createDocument(WebCore::KURL const&) + 147
18  QtWebKit                         0x0000000103ca9faa WebCore::DocumentWriter::begin(WebCore::KURL const&, bool, WebCore::Document*) + 106
19  QtWebKit                         0x0000000103f562cd WebCore::SVGImage::dataChanged(bool) + 669
20  QtWebKit                         0x0000000103d8fc08 WebCore::Image::setData(WTF::PassRefPtr<WebCore::SharedBuffer>, bool) + 104
21  QtWebKit                         0x0000000103c91d5e WebCore::CachedImage::finishLoading(WebCore::ResourceBuffer*) + 158
22  QtWebKit                         0x0000000103cd4935 WebCore::SubresourceLoader::didFinishLoading(double) + 133
23  QtWebKit                         0x0000000103e80331 WebCore::QNetworkReplyHandler::finish() + 257
24  QtWebKit                         0x0000000103e7ec4b WebCore::QNetworkReplyHandlerCallQueue::flush() + 203
25  QtWebKit                         0x0000000103e81f1a WebCore::QNetworkReplyWrapper::qt_static_metacall(QObject*, QMetaObject::Call, int, void**) + 58
26  QtCore                           0x00000001072fcc6f QMetaObject::activate(QObject*, int, int, void**) + 1871
27  QtNetwork                        0x00000001068e2f41 QNetworkReplyHttpImplPrivate::finished() + 1153
28  QtNetwork                        0x0000000106963b2d QNetworkReplyHttpImpl::qt_static_metacall(QObject*, QMetaObject::Call, int, void**) + 1901
29  QtCore                           0x00000001072f5d7b QObject::event(QEvent*) + 747
30  QtWidgets                        0x00000001033dc2dc QApplicationPrivate::notify_helper(QObject*, QEvent*) + 300
31  QtWidgets                        0x00000001033ded9b QApplication::notify(QObject*, QEvent*) + 6187
32  org.bitshares.btsx               0x0000000101b0235e BitSharesApp::notify(QObject*, QEvent*) + 14
33  QtCore                           0x00000001072c95d7 QCoreApplicationPrivate::sendPostedEvents(QObject*, int, QThreadData*) + 631
34  libqcocoa.dylib                  0x000000010935cad6 QCocoaEventDispatcherPrivate::processPostedEvents() + 278
35  libqcocoa.dylib                  0x000000010935d478 QCocoaEventDispatcherPrivate::postedEventsSourceCallback(void*) + 40
36  com.apple.CoreFoundation         0x00007fff8b1c95b1 __CFRUNLOOP_IS_CALLING_OUT_TO_A_SOURCE0_PERFORM_FUNCTION__ + 17
37  com.apple.CoreFoundation         0x00007fff8b1bac62 __CFRunLoopDoSources0 + 242
38  com.apple.CoreFoundation         0x00007fff8b1ba3ef __CFRunLoopRun + 831
39  com.apple.CoreFoundation         0x00007fff8b1b9e75 CFRunLoopRunSpecific + 309
40  com.apple.HIToolbox              0x00007fff85e5aa0d RunCurrentEventLoopInMode + 226
41  com.apple.HIToolbox              0x00007fff85e5a7b7 ReceiveNextEventCommon + 479
42  com.apple.HIToolbox              0x00007fff85e5a5bc _BlockUntilNextEventMatchingListInModeWithFilter + 65
43  com.apple.AppKit                 0x00007fff90b6624e _DPSNextEvent + 1434
44  com.apple.AppKit                 0x00007fff90b6589b -[NSApplication nextEventMatchingMask:untilDate:inMode:dequeue:] + 122
45  com.apple.AppKit                 0x00007fff90b5999c -[NSApplication run] + 553
46  libqcocoa.dylib                  0x000000010935c1d4 QCocoaEventDispatcher::processEvents(QFlags<QEventLoop::ProcessEventsFlag>) + 2420
47  QtCore                           0x00000001072c5acd QEventLoop::exec(QFlags<QEventLoop::ProcessEventsFlag>) + 381
48  QtCore                           0x00000001072c9007 QCoreApplication::exec() + 359
49  org.bitshares.btsx               0x0000000101b00abb BitSharesApp::run() + 2667
50  org.bitshares.btsx               0x0000000101afff55 BitSharesApp::run(int&, char**) + 469
51  org.bitshares.btsx               0x0000000101ae06c4 main + 20
52  libdyld.dylib                    0x00007fff8c20a5fd start + 1

能否将Crash Report发上来,谢谢

7
中文(Chinese) / Re: 客户端0.4.8-b问题收集帖
« on: August 27, 2014, 12:02:01 am »
Mac GUI客户端一打开就Crash(界面显示Connext to BitShares X network),然后卸载,删除~/Library/Application Support/BitShares X目录后,重新安装依然Crash

8
General Discussion / Re: Delegates please Use Sub-Accounts
« on: July 24, 2014, 08:14:01 am »
My sub account
wallet_approve_delegate delegate.bitcoiner true

9
DAC 委托人 / Re: 受托人拉票贴
« on: July 23, 2014, 03:19:32 pm »
受托人账户名:bitcoiner, 我的硬件:E3 1230v2,公司网络,7*24小时,希望能为BTS事业贡献一份力量,也希望能对虚拟货币多一些了解和学习。

10
liondani post a solution that work for me +5% +5% +5% +5% +5% :P :P :P :P :P


1)wallet_delegate_set_block_production ALL false

2)wallet_rescan_blockchain


3) don't forget to set again:
wallet_delegate_set_block_production ALL true

Awesome, also works for me. Thanks very much

11
I voted for some delegates, and then transfer some bts to myself. After almost 1 hour still shows me "Pending" in Recent Transactions.

Pending    bitcoiner bitcoiner hha 100 BTSX  0.1 BTSX

12
General Discussion / Re: Dry Run 6: Great Scott!
« on: June 26, 2014, 12:04:29 pm »
Code: [Select]
[ 89%] Building CXX object libraries/net/CMakeFiles/bts_net.dir/node.cpp.o
/Users/even/dev/bts/bitshares_toolkit/libraries/net/node.cpp:475:21: error: no member named 'set_actual_rate_time_constant' in
      'fc::rate_limiting_group'
      _rate_limiter.set_actual_rate_time_constant(fc::seconds(2));
      ~~~~~~~~~~~~~ ^
/Users/even/dev/bts/bitshares_toolkit/libraries/net/node.cpp:893:52: error: no member named 'get_actual_download_rate' in
      'fc::rate_limiting_group'
        uint32_t usage_this_second = _rate_limiter.get_actual_download_rate() + _rate_limiter.get_actual_upload_rate();
                                     ~~~~~~~~~~~~~ ^
/Users/even/dev/bts/bitshares_toolkit/libraries/net/node.cpp:893:95: error: no member named 'get_actual_upload_rate' in
      'fc::rate_limiting_group'
        uint32_t usage_this_second = _rate_limiter.get_actual_download_rate() + _rate_limiter.get_actual_upload_rate();
                                                                                ~~~~~~~~~~~~~ ^
/Users/even/dev/bts/bitshares_toolkit/libraries/net/node.cpp:905:22: warning: unused variable 'average_this_hour'
      [-Wunused-variable]
            uint32_t average_this_hour = (uint32_t)boost::accumulate(_average_network_usage_minutes, UINT64_C(0)) / _a...
                     ^
1 warning and 3 errors generated.
make[2]: *** [libraries/net/CMakeFiles/bts_net.dir/node.cpp.o] Error 1
make[1]: *** [libraries/net/CMakeFiles/bts_net.dir/all] Error 2
Can someone help? this problem happened on my Mac OSX 10.9.

13
General Discussion / Re: Dry Run 6: Great Scott!
« on: June 26, 2014, 09:20:31 am »
cmake -DCMAKE_PREFIX_PATH=/usr/local/ssl .
CMake Error at CMakeLists.txt:16 (include):
  include could not find load file:

    GetGitRevisionDescription


CMake Error at CMakeLists.txt:17 (get_git_head_revision):
  Unknown CMake command "get_git_head_revision".

Can anyone help?
Enviroument : Mac OS 10.9

might be that after git checkout, you need to do a
Code: [Select]
git submodule init && git submodule update
forgot it myself a few times, now I remember ;)

Thanks! I think GFW causes this problem, fucking GFW >:(
Code: [Select]
git submodule update
Cloning into 'libraries/fc'...
fatal: unable to access 'https://github.com/InvictusInnovations/fc.git/': Failed connect to github.com:8087; Connection refused
Clone of 'https://github.com/InvictusInnovations/fc.git' into submodule path 'libraries/fc' failed

14
General Discussion / Re: Dry Run 6: Great Scott!
« on: June 26, 2014, 08:26:11 am »
cmake -DCMAKE_PREFIX_PATH=/usr/local/ssl .
CMake Error at CMakeLists.txt:16 (include):
  include could not find load file:

    GetGitRevisionDescription


CMake Error at CMakeLists.txt:17 (get_git_head_revision):
  Unknown CMake command "get_git_head_revision".

Can anyone help?
Enviroument : Mac OS 10.9
I think you should upgrade your cmake to 2.8.12 or later.
Actually I used 2.8.12.2, the lastest is 3.0.0.

15
General Discussion / Re: Dry Run 6: Great Scott!
« on: June 26, 2014, 08:11:35 am »
cmake -DCMAKE_PREFIX_PATH=/usr/local/ssl .
CMake Error at CMakeLists.txt:16 (include):
  include could not find load file:

    GetGitRevisionDescription


CMake Error at CMakeLists.txt:17 (get_git_head_revision):
  Unknown CMake command "get_git_head_revision".

Can anyone help?
Enviroument : Mac OS 10.9

Pages: [1] 2 3