fatal error: WebUpdates.hpp: No such file or directory

Started by bitcoinerS, September 19, 2014, 03:25:40 PM

Previous topic - Next topic

0 Members and 1 Guest are viewing this topic.

bitcoinerS

>>> approve bitcoiners

bitcoinerS

#5
Found the problem. Had to


rm CMakeCache.txt
cmake .



now it compiles.

Actually this did not solve the problem, just removed web_wallet build from configuration. So now I did

cmake -DINCLUDE_QT_WALLET=ON .

and getting the same error again.

fatal error: WebUpdates.hpp: No such file or directory
>>> approve bitcoiners

emski

[url="https://bitsharestalk.org/index.php/topic,9857.0.html"]https://bitsharestalk.org/index.php/topic,9857.0.html[/url]

bitcoinerS

>>> approve bitcoiners

toast

Do not use this post as information for making any important decisions. The only agreements I ever make are informal and non-binding. Take the same precautions as when dealing with a compromised account, scammer, sockpuppet, etc.

bitcoinerS

#1
Having problems compiling 0.4.16-RC1 on Ubuntu 14.10.

[code][ 92%] Building CXX object programs/utils/web_update_utility/CMakeFiles/web_update_utility.dir/main.cpp.o
In file included from /home/bitcoiners/local/bitsharesx/programs/utils/web_update_utility/main.cpp:1:0:
/home/bitcoiners/local/bitsharesx/programs/utils/web_update_utility/update_utility.hpp:5:26: fatal error: WebUpdates.hpp: No such file or directory
#include <WebUpdates.hpp>
                          ^
compilation terminated.
programs/utils/web_update_utility/CMakeFiles/web_update_utility.dir/build.make:54: recipe for target 'programs/utils/web_update_utility/CMakeFiles/web_update_utility.dir/main.cpp.o' failed
make[2]: *** [programs/utils/web_update_utility/CMakeFiles/web_update_utility.dir/main.cpp.o] Error 1
CMakeFiles/Makefile2:1826: recipe for target 'programs/utils/web_update_utility/CMakeFiles/web_update_utility.dir/all' failed
make[1]: *** [programs/utils/web_update_utility/CMakeFiles/web_update_utility.dir/all] Error 2
Makefile:103: recipe for target 'all' failed
make: *** [all] Error 2
>>> approve bitcoiners